Не удалось Android Студия 0.5.2 Gradle Refresh Project

? Adrian Olar @ | Original: StackOverFlow
---

ОБНОВЛЕНО С МОИМ СОБЫТИЙ

Последнее редактирование После опробовать все возможные решения я мог найти я пришел ксвежей установки Windows. Делать это я заметил, что это было indeeed вопрос брандмауэра, мой антивирус был заблокированstudio64.exe process.

Я только что установленной Android Студия 0.4.2, то сразу обновляется 0.5.2 без открытия или создания каких-либо новых проектов.

Я обновилAndroid SDK затем создал новый проект. Я постоянно получаюошибки с Gradle Обновить удалось, хотя я пытался изменить локальный Gradle распределение, ничто не похоже на работу, все, что я стараюсь Gradle отвечает : " Пожалуйста, исправьте конфигурацию Gradle " ...

Это случилось со мной, так как я обновлена ​​до Android студии 5.1, никогда раньше.

Я попытался с Gradle 1,10 и 1,11 и обертки Gradle включены в установочный комплект можно загрузить с веб-сайта http://developer.android.com/sdk/installing/studio.html

Вот мои Gradle файлы :

apply plugin: 'android'

android {
    compileSdkVersion 19
    buildToolsVersion "19.0.3"

    defaultConfig {
        minSdkVersion 8
        targetSdkVersion 19
        versionCode 1
        versionName "1.0"
    }
    buildTypes {
        release {
            runProguard false
            proguardFiles getDefaultProguardFile('proguard-android.txt'), 'proguard-rules.txt'
        }
    }
}

dependencies {
    compile 'com.android.support:appcompat-v7:+'
    compile fileTree(dir: 'libs', include: ['*.jar'])
}

Иза файл build.gradle .

// Top-level build file where you can add configuration options common to all sub-projects/modules.

buildscript {
    repositories {
        mavenCentral()
    }
    dependencies {
        classpath 'com.android.tools.build:gradle:0.9.+'
    }
}

allprojects {
    repositories {
        mavenCentral()
    }
}

Теперь я пытался загрузить последнюю версию с Канарских Постройте и загрузки SDK sepparately, до сих пор тот же вопрос, что это действительно раздражает ... есть ли настройка сети я мог бы быть с установки неправильно ?

В настоящее время я использую по умолчанию grale обертку в с Android Studio, и этоЯ получаю ошибку :

10:58:37 AM Gradle 'ClujTourist' project refresh failed:
            A fatal exception has occurred. Program will exit.
            : Gradle settings

После попытки скомпилировать проект с : gradlew.bat --stacktrace assemble

это то, что я получил:

C:UsersAdrian-PCAndroidStudioProjectsClujTourist>gradlew.bat --stacktrace as
semble

FAILURE: Build failed with an exception.

* What went wrong:
A problem occurred configuring root project 'ClujTourist'.
> Could not resolve all dependencies for configuration ':classpath'.
   > Could not find any version that matches com.android.tools.build:gradle:0.11
.+.
     Required by:
         :ClujTourist:unspecified

* Try:
Run with --info or --debug option to get more log output.

* Exception is:
org.gradle.api.ProjectConfigurationException: A problem occurred configuring roo
t project 'ClujTourist'.
        at org.gradle.configuration.project.LifecycleProjectEvaluator.addConfigu
rationFailure(LifecycleProjectEvaluator.java:79)
        at org.gradle.configuration.project.LifecycleProjectEvaluator.evaluate(L
ifecycleProjectEvaluator.java:57)
        at org.gradle.api.internal.project.AbstractProject.evaluate(AbstractProj
ect.java:507)
        at org.gradle.api.internal.project.AbstractProject.evaluate(AbstractProj
ect.java:82)
        at org.gradle.configuration.DefaultBuildConfigurer.configure(DefaultBuil
dConfigurer.java:31)
        at org.gradle.initialization.DefaultGradleLauncher.doBuildStages(Default
GradleLauncher.java:142)
        at org.gradle.initialization.DefaultGradleLauncher.doBuild(DefaultGradle
Launcher.java:113)
        at org.gradle.initialization.DefaultGradleLauncher.run(DefaultGradleLaun
cher.java:81)
        at org.gradle.launcher.exec.InProcessBuildActionExecuter$DefaultBuildCon
troller.run(InProcessBuildActionExecuter.java:64)
        at org.gradle.launcher.cli.ExecuteBuildAction.run(ExecuteBuildAction.jav
a:33)
        at org.gradle.launcher.cli.ExecuteBuildAction.run(ExecuteBuildAction.jav
a:24)
        at org.gradle.launcher.exec.InProcessBuildActionExecuter.execute(InProce
ssBuildActionExecuter.java:35)
        at org.gradle.launcher.exec.InProcessBuildActionExecuter.execute(InProce
ssBuildActionExecuter.java:26)
        at org.gradle.launcher.cli.RunBuildAction.run(RunBuildAction.java:50)
        at org.gradle.internal.Actions$RunnableActionAdapter.execute(Actions.jav
a:171)
        at org.gradle.launcher.cli.CommandLineActionFactory$ParseAndBuildAction.
execute(CommandLineActionFactory.java:201)
        at org.gradle.launcher.cli.CommandLineActionFactory$ParseAndBuildAction.
execute(CommandLineActionFactory.java:174)
        at org.gradle.launcher.cli.CommandLineActionFactory$WithLogging.execute(
CommandLineActionFactory.java:170)
        at org.gradle.launcher.cli.CommandLineActionFactory$WithLogging.execute(
CommandLineActionFactory.java:139)
        at org.gradle.launcher.cli.ExceptionReportingAction.execute(ExceptionRep
ortingAction.java:33)
        at org.gradle.launcher.cli.ExceptionReportingAction.execute(ExceptionRep
ortingAction.java:22)
        at org.gradle.launcher.Main.doAction(Main.java:46)
        at org.gradle.launcher.bootstrap.EntryPoint.run(EntryPoint.java:45)
        at org.gradle.launcher.Main.main(Main.java:37)
        at org.gradle.launcher.bootstrap.ProcessBootstrap.runNoExit(ProcessBoots
trap.java:50)
        at org.gradle.launcher.bootstrap.ProcessBootstrap.run(ProcessBootstrap.j
ava:32)
        at org.gradle.launcher.GradleMain.main(GradleMain.java:23)
        at org.gradle.wrapper.BootstrapMainStarter.start(BootstrapMainStarter.ja
va:33)
        at org.gradle.wrapper.WrapperExecutor.execute(WrapperExecutor.java:130)
        at org.gradle.wrapper.GradleWrapperMain.main(GradleWrapperMain.java:48)
Caused by: org.gradle.api.artifacts.ResolveException: Could not resolve all depe
ndencies for configuration ':classpath'.
        at org.gradle.api.internal.artifacts.ivyservice.DefaultLenientConfigurat
ion.rethrowFailure(DefaultLenientConfiguration.java:52)
        at org.gradle.api.internal.artifacts.ivyservice.DefaultResolvedConfigura
tion.rethrowFailure(DefaultResolvedConfiguration.java:36)
        at org.gradle.api.internal.artifacts.ivyservice.SelfResolvingDependencyR
esolver$FilesAggregatingResolvedConfiguration.rethrowFailure(SelfResolvingDepend
encyResolver.java:106)
        at org.gradle.api.internal.artifacts.ivyservice.ErrorHandlingArtifactDep
endencyResolver$ErrorHandlingResolvedConfiguration.rethrowFailure(ErrorHandlingA
rtifactDependencyResolver.java:176)
        at org.gradle.api.internal.artifacts.configurations.DefaultConfiguration
$ConfigurationFileCollection.getFiles(DefaultConfiguration.java:465)
        at org.gradle.api.internal.artifacts.configurations.DefaultConfiguration
.getFiles(DefaultConfiguration.java:202)
        at org.gradle.api.internal.artifacts.configurations.DefaultConfiguration
_Decorated.getFiles(Unknown Source)
        at org.gradle.api.internal.initialization.DefaultScriptHandler.updateCla
ssPath(DefaultScriptHandler.java:75)
        at org.gradle.configuration.DefaultScriptPluginFactory$ScriptPluginImpl.
apply(DefaultScriptPluginFactory.java:145)
        at org.gradle.configuration.project.BuildScriptProcessor.execute(BuildSc
riptProcessor.java:38)
        at org.gradle.configuration.project.BuildScriptProcessor.execute(BuildSc
riptProcessor.java:25)
        at org.gradle.configuration.project.ConfigureActionsProjectEvaluator.eva
luate(ConfigureActionsProjectEvaluator.java:34)
        at org.gradle.configuration.project.LifecycleProjectEvaluator.evaluate(L
ifecycleProjectEvaluator.java:55)
        ... 28 more
Caused by: org.gradle.api.internal.artifacts.ivyservice.ModuleVersionNotFoundExc
eption: Could not find any version that matches com.android.tools.build:gradle:0
.11.+.
Required by:
    :ClujTourist:unspecified
        at org.gradle.api.internal.artifacts.ivyservice.ivyresolve.LazyDependenc
yToModuleResolver$DynamicVersionResolveResult.notFound(LazyDependencyToModuleRes
olver.java:170)
        at org.gradle.api.internal.artifacts.ivyservice.ivyresolve.LazyDependenc
yToModuleResolver$AbstractVersionResolveResult.resolve(LazyDependencyToModuleRes
olver.java:91)
        at org.gradle.api.internal.artifacts.ivyservice.ivyresolve.LazyDependenc
yToModuleResolver.resolve(LazyDependencyToModuleResolver.java:47)
        at org.gradle.api.internal.artifacts.ivyservice.VersionForcingDependency
ToModuleResolver.resolve(VersionForcingDependencyToModuleResolver.java:48)
        at org.gradle.api.internal.artifacts.ivyservice.resolveengine.Dependency
GraphBuilder$ModuleVersionSelectorResolveState.resolveModuleRevisionId(Dependenc
yGraphBuilder.java:935)
        at org.gradle.api.internal.artifacts.ivyservice.resolveengine.Dependency
GraphBuilder$DependencyEdge.resolveModuleRevisionId(DependencyGraphBuilder.java:
296)
        at org.gradle.api.internal.artifacts.ivyservice.resolveengine.Dependency
GraphBuilder.traverseGraph(DependencyGraphBuilder.java:93)
        at org.gradle.api.internal.artifacts.ivyservice.resolveengine.Dependency
GraphBuilder.resolve(DependencyGraphBuilder.java:66)
        at org.gradle.api.internal.artifacts.ivyservice.resolveengine.DefaultDep
endencyResolver$1.transform(DefaultDependencyResolver.java:108)
        at org.gradle.api.internal.artifacts.ivyservice.resolveengine.DefaultDep
endencyResolver$1.transform(DefaultDependencyResolver.java:77)
        at org.gradle.api.internal.artifacts.ivyservice.DefaultIvyContextManager
.withIvy(DefaultIvyContextManager.java:61)
        at org.gradle.api.internal.artifacts.ivyservice.resolveengine.DefaultDep
endencyResolver.resolve(DefaultDependencyResolver.java:77)
        at org.gradle.api.internal.artifacts.ivyservice.CacheLockingArtifactDepe
ndencyResolver$1.create(CacheLockingArtifactDependencyResolver.java:39)
        at org.gradle.api.internal.artifacts.ivyservice.CacheLockingArtifactDepe
ndencyResolver$1.create(CacheLockingArtifactDependencyResolver.java:37)
        at org.gradle.cache.internal.DefaultCacheAccess.useCache(DefaultCacheAcc
ess.java:148)
        at org.gradle.cache.internal.DefaultPersistentDirectoryStore.useCache(De
faultPersistentDirectoryStore.java:123)
        at org.gradle.api.internal.artifacts.ivyservice.DefaultCacheLockingManag
er.useCache(DefaultCacheLockingManager.java:77)
        at org.gradle.api.internal.artifacts.ivyservice.CacheLockingArtifactDepe
ndencyResolver.resolve(CacheLockingArtifactDependencyResolver.java:37)
        at org.gradle.api.internal.artifacts.ivyservice.SelfResolvingDependencyR
esolver.resolve(SelfResolvingDependencyResolver.java:41)
        at org.gradle.api.internal.artifacts.ivyservice.ShortcircuitEmptyConfigs
ArtifactDependencyResolver.resolve(ShortcircuitEmptyConfigsArtifactDependencyRes
olver.java:46)
        at org.gradle.api.internal.artifacts.ivyservice.ErrorHandlingArtifactDep
endencyResolver.resolve(ErrorHandlingArtifactDependencyResolver.java:44)
        at org.gradle.api.internal.artifacts.ivyservice.DefaultConfigurationReso
lver.resolve(DefaultConfigurationResolver.java:42)
        at org.gradle.api.internal.artifacts.configurations.DefaultConfiguration
.resolveNow(DefaultConfiguration.java:240)
        at org.gradle.api.internal.artifacts.configurations.DefaultConfiguration
.getResolvedConfiguration(DefaultConfiguration.java:230)
        at org.gradle.api.internal.artifacts.configurations.DefaultConfiguration
_Decorated.getResolvedConfiguration(Unknown Source)
        at org.gradle.api.internal.artifacts.configurations.DefaultConfiguration
$ConfigurationFileCollection.getFiles(DefaultConfiguration.java:463)
        ... 36 more


BUILD FAILED

Total time: 7.864 secs

C:UsersAdrian-PCAndroidStudioProjectsClujTourist>

Также пытался удалить .gradle и Gradle файлы из моего проекта. Ничто не похоже на работу.

EDIT что, кажется, работает для меня до сих пор заменяет каталог сервисов .gradle в корневом каталоге, как кажется, возможно, былопроблемой путь к этому каталогу. Позвольте мне знать, если это решить ее для Вас!

---

Top 5 ответ

1Maziar Bouali @

У меня была точно такая же проблема .

Чтобы решить, что просто создать еще один проект в Android Студия 0.5.2 и после этого, когда новый проект полностью создан и встроенный закрыть его и открыть свой старый проект (проект " ClujTourist »). Теперь вы можете построить ClueTourist успешно .

Пожалуйста, дайте мне знать, если что-то пойдет не так.

2Matt Logan @

Easy fix!

defaultConfig Часть вашего build.gradle файл должен идти изнутри buildTypes, как это:

apply plugin: 'android'

android {
    compileSdkVersion 19
    buildToolsVersion "19.0.3"


    buildTypes {
        defaultConfig {
            minSdkVersion 8
            targetSdkVersion 19
            versionCode 1
            versionName "1.0"
        }

        release {
            runProguard false
            proguardFiles getDefaultProguardFile('proguard-android.txt'), 'proguard-rules.txt'
        }
    }
}

dependencies {
    compile 'com.android.support:appcompat-v7:+'
    compile fileTree(dir: 'libs', include: ['*.jar'])
}

Обратитесь к руководству для http://tools.android.com/tech-docs/new-build-system/migrating_to_09 .

Кроме того, убедитесь, что вы используете последнюю дату распределения Gradle URL ( если вы используете оболочку Gradle ) .

В вашем gradle-wrapper.properties файл должен бытьследующая строка :

distributionUrl=http://services.gradle.org/distributions/gradle-1.11-all.zip

Наконец убедитесь, что вы clean ваш проект, прежде чем строить заново ( Build - > Очистить проект ) .

3lei jia @

В моем случае, я попытался эти два решения выше, но никто не мог решить эту проблему, я, наконец, закрыть мою программу безопасности AVAST ... Затем он работал ! Gradle синхронизации нормально .. Хотя я не знаю, почему, но закрытие AVAST сделал решить эту проблему.